Oracle database error messages/4

From Just Solve the File Format Problem
Jump to: navigation, search
File Format
Name Oracle database error messages

Please see Oracle database error message

Code Message
ORA-27021 sequential file handle must be specified
ORA-27022 skgfqsbi: could not allocate memory for media manager
ORA-27023 skgfqsbi: media manager protocol error
ORA-27024 skgfqsbi: sbtinit2 returned error
ORA-27025 skgfqsbi: invalid media manager context area size
ORA-27026 skgfrls: sbtend returned error
ORA-27027 sbtremove2 returned error
ORA-27028 skgfqcre: sbtbackup returned error
ORA-27029 skgfrtrv: sbtrestore returned error
ORA-27030 skgfwrt: sbtwrite2 returned error
ORA-27031 mirror resilvering functions not supported
ORA-27032 failed to obtain file size limit
ORA-27033 failed to obtain file size limit
ORA-27034 maximum length of ORACLE_SID exceeded
ORA-27035 logical block size is invalid
ORA-27036 translation error, unable to expand file name
ORA-27037 unable to obtain file status
ORA-27038 created file already exists
ORA-27039 create file failed, file size limit reached
ORA-27040 file create error, unable to create file
ORA-27041 unable to open file
ORA-27042 not enough space on raw partition to fullfill request
ORA-27043 unable to seek to beginning of file
ORA-27044 unable to write the header block of file
ORA-27045 unable to close the file
ORA-27046 file size is not a multiple of logical block size
ORA-27047 unable to read the header block of file
ORA-27048 skgfifi: file header information is invalid
ORA-27049 unable to seek to and read the last block
ORA-27050 function called with invalid FIB/IOV structure
ORA-27052 unable to flush file data
ORA-27053 blocksize in file header not a multiple of logical block size
ORA-27054 NFS file system where the file is created or resides is not mounted with correct options
ORA-27056 could not delete file
ORA-27057 cannot perform async I/O to file
ORA-27058 file I/O question parameter is invalid
ORA-27059 could not reduce file size
ORA-27060 could not set close-on-exec bit on file
ORA-27061 waiting for async I/Os failed
ORA-27062 could not find pending async I/Os
ORA-27063 number of bytes read/written is incorrect
ORA-27064 cannot perform async I/O to file
ORA-27065 cannot perform async vector I/O to file
ORA-27066 number of buffers in vector I/O exceeds maximum
ORA-27067 size of I/O buffer is invalid
ORA-27068 I/O buffer is not aligned properly
ORA-27069 attempt to do I/O beyond the range of the file
ORA-27070 async read/write failed
ORA-27071 unable to seek to desired position in file
ORA-27072 File I/O error
ORA-27073 Trying to close a file which has async I/Os pending to be dequeued
ORA-27074 unable to determine limit for open files
ORA-27075 SSTMOFRC constant too large
ORA-27076 unable to set limit for open files
ORA-27077 too many files open
ORA-27078 unable to determine limit for open files
ORA-27079 unable to set async IO limit
ORA-27080 too many files open
ORA-27081 unable to close the file
ORA-27083 waiting for async I/Os failed
ORA-27084 unable to get/set file status flags
ORA-27086 unable to lock file - already in use
ORA-27087 unable to get share lock - file not readable
ORA-27088 unable to get file status
ORA-27089 unable to release advisory lock
ORA-27090 Unable to reserve kernel resources for asynchronous disk I/O
ORA-27091 unable to queue I/O
ORA-27092 size of file exceeds file size limit of the process
ORA-27093 could not delete directory
ORA-27094 raw volume used can damage partition table
ORA-27095 fail to get the disk sector size
ORA-27096 fail to get file size
ORA-27099 failed to create file
ORA-27100 shared memory realm already exists
ORA-27101 shared memory realm does not exist
ORA-27102 out of memory
ORA-27103 internal error
ORA-27120 unable to remove shared memory segment
ORA-27121 unable to determine size of shared memory segment
ORA-27122 unable to protect memory
ORA-27123 unable to attach to shared memory segment
ORA-27124 unable to detach from shared memory segment
ORA-27125 unable to create shared memory segment
ORA-27126 unable to lock shared memory segment in core
ORA-27127 unable to unlock shared memory segment
ORA-27128 unable to determine pagesize
ORA-27133 unable to determine stacksize
ORA-27134 unable to set stacksize
ORA-27135 Operating System hard stack limit is set too low
ORA-27136 MPMT and VLM are both enabled
ORA-27137 unable to allocate large pages to create a shared memory segment
ORA-27139 unable to reserve Oracle VM mapping in process address space
ORA-27140 attach to post/wait facility failed
ORA-27141 invalid process ID
ORA-27142 could not create new process
ORA-27143 OS system call failure
ORA-27144 attempt to kill process failed
ORA-27145 insufficient resources for requested number of processes
ORA-27146 post/wait initialization failed
ORA-27147 post/wait reset failed
ORA-27148 spawn wait error
ORA-27149 assignment out of range
ORA-27150 attempt to notify process of pending oradebug call failed
ORA-27151 buffer not large enough to hold process ID string
ORA-27152 attempt to post process failed
ORA-27153 wait operation failed
ORA-27154 post/wait create failed
ORA-27155 could not execute file
ORA-27156 request for process information failed
ORA-27157 OS post/wait facility removed
ORA-27158 process control failure
ORA-27159 failure setting process scheduling priority
ORA-27160 process requested to perform operation
ORA-27161 request for Oracle binary information failed
ORA-27162 thread creation failed
ORA-27163 out of memory
ORA-27164 tried to join detached thread
ORA-27165 tried to join thread that does not exist
ORA-27166 tried to join current thread
ORA-27167 Attempt to determine if Oracle binary image is stored on remote server failed
ORA-27168 Translation from hostname to network address failed
ORA-27190 skgfrd: sbtread2 returned error
ORA-27191 sbtinfo2 returned error
ORA-27192 skgfcls: sbtclose2 returned error - failed to close file
ORA-27193 sbtinfo2 did not return volume label
ORA-27194 skgfdvcmd: sbtcommand returned error
ORA-27195 proxy copy not supported
ORA-27196 skgfpbk: sbtpcbackup returned error
ORA-27197 skgfprs: sbtpcrestore returned error
ORA-27198 skgfpvl: sbtpcvalidate returned error
ORA-27199 skgfpst: sbtpcstatus returned error
ORA-27200 skgfpgo: sbtpcstart returned error
ORA-27201 skgfpcm: sbtpccommit returned error
ORA-27202 skgfpen: sbtpcend returned error
ORA-27203 skgfpqb: sbtpcquerybackup returned error
ORA-27204 skgfpqr: sbtpcqueryrestore returned error
ORA-27205 skgfpcn: sbtpccancel returned error
ORA-27206 requested file not found in media management catalog
ORA-27207 syntax error in device PARMS - parentheses mismatch or missing
ORA-27208 syntax error in device PARMS - environment variable value missing
ORA-27209 syntax error in device PARMS - unknown keyword or missing =
ORA-27210 syntax error in device PARMS
ORA-27211 Failed to load Media Management Library
ORA-27212 some entrypoints in Media Management Library are missing
ORA-27213 failed to unload Media Management Library
ORA-27214 skgfrsfe: file search failed
ORA-27215 skgfgsmcs: sbtinfo2 returned unknown file
ORA-27216 skgfgsmcs: sbtinfo2 returned a malformed response
ORA-27217 failed to load Media Management Library from secure location
ORA-27218 failed to read ACFS mirror
ORA-27230 OS system call failure
ORA-27231 unable to close file
ORA-27232 unable to get file information
ORA-27233 file is not an ELF file
ORA-27234 unable to read file
ORA-27235 unable to map file region into memory
ORA-27236 unable to unmap file from memory
ORA-27237 ELF file is not a relocatable object file
ORA-27238 ELF file is not an executable
ORA-27239 ELF file is not a shared object file
ORA-27240 ELF file does not have a required section
ORA-27241 ELF-shared library has multiple sections of the same type
ORA-27242 ELF file has invalid hash table entry size
ORA-27243 ELF file has too many relocation sections
ORA-27244 unable to determine base value for data relocation from ELF file
ORA-27245 unable to dlopen() binary image
ORA-27246 unable to open file
ORA-27250 OS system call failure
ORA-27270 szingroup: malloc failed
ORA-27271 szingroup: group lookup failure
ORA-27300 OS system dependent operation:string failed with status: string
ORA-27301 OS failure message: string
ORA-27302 failure occurred at: string
ORA-27303 additional information: string
ORA-27351 conflicting values of job attributes string and string
ORA-27353 job attribute string is missing
ORA-27354 attribute string cannot be set for lightweight jobs
ORA-27356 invalid job argument
ORA-27357 duplicate reference to job object string
ORA-27359 duplicate reference to attribute string of job string
ORA-27361 scheduler API invoked with illegal or inconsistent arguments
ORA-27362 batch API call completed with errors
ORA-27363 invalid program for lightweight job
ORA-27364 remote database string already registered as string
ORA-27365 job has been notified to stop, but failed to do so immediately
ORA-27366 job "string.string" is not running
ORA-27367 program "string.string" associated with this job is disabled
ORA-27369 job of type EXECUTABLE failed with exit code: string
ORA-27370 job slave failed to launch a job of type EXECUTABLE
ORA-27371 jobs of type EXECUTABLE are not supported on this platform
ORA-27372 length of action and arguments exceeds platform limit string
ORA-27373 unknown or illegal event source queue
ORA-27374 insufficient privileges on event source queue
ORA-27375 valid agent name must be specified for secure queues
ORA-27376 event condition cannot be NULL
ORA-27377 windows cannot have event based schedules
ORA-27378 cannot stop jobs of type EXECUTABLE on this platform
ORA-27379 INSTANCE_ID attribute conflicts with job class settings
ORA-27399 job type EXECUTABLE requires the CREATE EXTERNAL JOB privilege
ORA-27411 empty string is not a valid repeat interval.
ORA-27412 repeat interval or calendar contains invalid identifier: string
ORA-27413 repeat interval is too long
ORA-27414 Invalid string clause value
ORA-27415 repeat interval or calendar must start with a frequency clause
ORA-27416 BYDAY clause in repeat interval or calendar contains an invalid weekday
ORA-27417 BYWEEKNO clause requires YEARLY clause
ORA-27418 syntax error in repeat interval or calendar
ORA-27419 unable to determine valid execution date from repeat interval
ORA-27420 Following message from string interval interpreter
ORA-27421 calendar expression restriction string encountered
ORA-27422 usage of string not supported in embedded calendar application "string"."string"
ORA-27423 calendar clause string specified more than once
ORA-27424 calendar clauses string and string are incompatible
ORA-27431 chain string.string has a user-managed rule set
ORA-27432 step string does not exist for chain string.string
ORA-27433 cannot alter state of step string for job string.string to string
ORA-27434 cannot alter chain step job string.string.string
ORA-27435 chain job terminated abnormally
ORA-27451 string cannot be NULL
ORA-27452 string is an invalid name for a database object.
ORA-27453 string is an invalid job or program argument name.
ORA-27454 argument name and position cannot be NULL
ORA-27455 Only "SYS" is a valid schema for a string.
ORA-27456 not all arguments of program "string.string" have been defined
ORA-27457 argument string of job "string.string" has no value
ORA-27458 A program of type PLSQL_BLOCK cannot have any arguments.
ORA-27459 A program of type EXECUTABLE must have character-only arguments.
ORA-27460 cannot execute disabled job "string.string"
ORA-27461 The value for attribute string is too large.
ORA-27463 invalid program type string
ORA-27464 invalid schedule type string
ORA-27465 invalid value string for attribute string
ORA-27467 invalid datatype for string value
ORA-27468 "string.string" is locked by another process
ORA-27469 string is not a valid string attribute
ORA-27470 failed to re-enable "string.string" after making requested change
ORA-27471 window "string.string" is already closed
ORA-27472 invalid metadata attribute string
ORA-27473 argument string does not exist
ORA-27474 cannot give both an argument name and an argument position
ORA-27475 "string.string" must be a string
ORA-27476 "string.string" does not exist
ORA-27477 "string.string" already exists
ORA-27478 job "string.string" is running
ORA-27479 Cannot string "string.string" because other objects depend on it
ORA-27480 window "string" is currently open
ORA-27481 "string.string" has an invalid schedule
ORA-27483 "string.string" has an invalid END_DATE
ORA-27484 Argument names are not supported for jobs without a program.
ORA-27485 argument string already exists at a different position
ORA-27486 insufficient privileges
ORA-27487 invalid object privilege for a string
ORA-27488 unable to set string because string was/were already set
ORA-27489 unable to process job "string.string" from job class "string"
ORA-27490 cannot open disabled window "string.string"
ORA-27491 repeat_interval and start_date cannot both be NULL
ORA-27492 unable to run job "string.string": scheduler unavailable
ORA-27500 inter-instance IPC error
ORA-27501 IPC error creating a port
ORA-27502 IPC error deleting OSD context
ORA-27503 IPC error attempting to cancel request
ORA-27504 IPC error creating OSD context
ORA-27505 IPC error destroying a port
ORA-27506 IPC error connecting to a port
ORA-27507 IPC error disconnecting from a port
ORA-27508 IPC error sending a message
ORA-27509 IPC error receiving a message
ORA-27510 IPC error waiting for a request to complete
ORA-27512 IPC error posting a process
ORA-27513 parameter string contains invalid value string
ORA-27542 Failed to unprepare a buffer prepared for remote update
ORA-27543 Failed to cancel outstanding IPC request
ORA-27544 Failed to map memory region for export
ORA-27545 Fail to prepare buffer for remote update
ORA-27546 Oracle compiled against IPC interface version string.string found version string.string
ORA-27547 Unable to query IPC OSD attribute string
ORA-27548 Unable to unprepare IPC buffer
ORA-27550 Target ID protocol check failed. tid vers=string, type=string, remote instance number=string, local instance number=string
ORA-27601 Cell storage initialization failed, cell library error code [string]
ORA-27602 Failure to publish network status information, cell library error code [string]
ORA-27603 Cell storage I/O error, I/O failed on disk string at offset string for data length string
ORA-27604 Cell storage ioctl error, ioctl failed on disk string
ORA-27605 Smart I/O failed as a handle could not be obtained to the cell "string" as the cell is not accessible.
ORA-27606 Smart I/O failed because the diskgroup was found to be unmounted. tablespace number: "string", file number: "string"
ORA-27607 Smart I/O failed because there were no online disks. tablespace number: "string", file number: "string"
ORA-27608 Smart I/O failed because the disk "string" on the cell "string" was not open. error code: "string", "string"
ORA-27609 Smart I/O failed due to a network error to the cell "string". error code "string", "string"
ORA-27610 Smart I/O failed due to shortage of memory on the cell "string"
ORA-27611 Smart I/O failed due to a block corruption detected on the host. The block was received from cell "string". disk: "string", block: "string", disk offset: "string"
ORA-27612 Smart I/O failed due to a block corruption detected on the cell "string". disk: "string", block: "string", disk offset: "string"
ORA-27613 Smart I/O failed due to an I/O error on the cell "string". disk: "string", block: "string", disk offset: "string" I/O size: "string"
ORA-27614 Smart I/O failed due to an error "string, string" from the cell "string". disk: "string", block: "string", disk offset: "string" I/O size: "string"
ORA-27615 Smart I/O file to ASM disk translation failed with error: string.
ORA-27616 ASM Allocation Unit: string
ORA-27617 Smart I/O failed because of an internal error. Cell "string", disk "string", cell library error code "string, string", error information "string"
ORA-27618 Smart I/O failed because of an internal error. Cell "string", cell library error code "string, string", error information "string"
ORA-27619 Smart I/O failed because of an internal error when determining the time zone file version. Error code "string"
ORA-27621 The value of string is not valid for parameter string
ORA-27623 Cell automation SQL action failed
ORA-27624 Smart I/O failed because the number of reconnects to the cell "string" exceeded the maximum allowed "string".
ORA-27625 Exadata configuration failed.
ORA-27626 Exadata error: string (string)
ORA-27628 An invalid value was specified for the parameter string.
ORA-28000 the account is locked
ORA-28001 the password has expired
ORA-28002 the password will expire within string days
ORA-28003 password verification for the specified password failed
ORA-28004 invalid argument for function specified in PASSWORD_VERIFY_FUNCTION string
ORA-28005 invalid logon flags
ORA-28006 conflicting values for parameters string and string
ORA-28007 the password cannot be reused
ORA-28008 invalid old password
ORA-28009 connection as SYS should be as SYSDBA or SYSOPER
ORA-28010 cannot expire external or global accounts
ORA-28011 the account will expire soon; change your password now
ORA-28013 the password has expired
ORA-28015 Account unlock attempted on read-only database but a conflicting account lockout on the primary exists
ORA-28020 IDENTIFIED GLOBALLY already specified
ORA-28021 cannot grant global roles
ORA-28022 cannot grant external roles to global user or role
ORA-28023 must revoke grants of this role to other user(s) first
ORA-28024 must revoke grants of external roles to this role/user
ORA-28025 missing or null external name
ORA-28026 user with same external name already exists
ORA-28027 privileged database links may be used by global users
ORA-28028 could not authenticate remote server
ORA-28029 could not authorize remote server for user string
ORA-28030 Server encountered problems accessing LDAP directory service
ORA-28031 maximum of string enabled roles exceeded
ORA-28032 Your password has expired and the database is set to read-only
ORA-28035 Cannot Get Session Key for Authentication
ORA-28037 Cannot Get Session Key for RACF Authentication
ORA-28038 disallow O2LOGON
ORA-28039 cannot validate Kerberos service ticket
ORA-28040 No matching authentication protocol
ORA-28041 Authentication protocol internal error
ORA-28042 Server authentication failed
ORA-28043 invalid bind credentials for DB-OID connection
ORA-28044 unsupported directory type
ORA-28045 SSL authentication between database and OID failed
ORA-28046 Password change for SYS disallowed
ORA-28047 database is not a member of any enterprise domain in OID
ORA-28048 database is a member of multiple enterprise domains in OID
ORA-28049 the password has expired
ORA-28050 specified user or role cannot be dropped
ORA-28051 the account is locked
ORA-28052 the account is disabled
ORA-28053 the account is inactive
ORA-28054 the password has expired. string Grace logins are left
ORA-28055 the password will expire within string days
ORA-28056 Writing audit records to Windows Event Log failed
ORA-28057 name of the password file could not be constructed
ORA-28059 Cross-instance call failed
ORA-28060 A data redaction policy already exists on this column.
ORA-28061 This object cannot have a data redaction policy defined on it.
ORA-28062 The policy expression is too long.
ORA-28063 The policy expression is empty.
ORA-28064 The redaction function is not valid.
ORA-28066 invalid column "string"
ORA-28067 missing or invalid column name
ORA-28068 The object "string" does not have a data redaction policy.
ORA-28069 A data redaction policy already exists on this object.
ORA-28070 The column "string" does not have a data redaction policy.
ORA-28071 The action is not valid.
ORA-28072 The specified policy name is incorrect.
ORA-28073 The column "string" has an unsupported data type.
ORA-28074 The "string" field of the redaction parameters is not valid.
ORA-28075 The policy expression has unsupported functions.
ORA-28076 An attribute was not specified for SYS_SESSION_ROLES.
ORA-28077 The attribute specified (string) exceeds the maximum length.
ORA-28078 A regular expression parameter is missing or invalid.
ORA-28079 The policy was already enabled.
ORA-28080 The policy was already disabled.
ORA-28081 Insufficient privileges - the command references a redacted object.
ORA-28082 The parameter string is invalid.
ORA-28083 A redacted column was referenced in a virtual column expression.
ORA-28085 The input and output lengths of the redaction do not match.
ORA-28086 The evaluation of the policy expression failed. string
ORA-28100 policy function schema string is invalid
ORA-28101 policy already exists
ORA-28102 policy does not exist
ORA-28103 adding a policy to an object owned by SYS is not allowed
ORA-28104 input value for string is not valid
ORA-28105 cannot create security relevant column policy in an object view
ORA-28106 input value for argument #string is not valid
ORA-28107 policy was disabled
ORA-28108 circular security policies detected
ORA-28109 the number of related policies has exceeded the limit of 16
ORA-28110 policy function or package string.string has error
ORA-28111 insufficient privilege to evaluate policy predicate
ORA-28112 failed to execute policy function
ORA-28113 policy predicate has error
ORA-28115 policy with check option violation
ORA-28116 insufficient privileges to do direct path access
ORA-28117 integrity constraint violated - parent record not found
ORA-28118 policy group already exists
ORA-28119 policy group does not exist
ORA-28120 driving context already exists
ORA-28121 driving context does not exist
ORA-28122 can not update SYS_DEFAULT policy group
ORA-28123 Driving context 'string,string' contains invalid group 'string'
ORA-28124 Column string in sec_relevant_cols cannot be of an object data type
ORA-28132 The MERGE INTO syntax does not support the security policy.
ORA-28134 object cannot have fine-grained access control policy
ORA-28137 Invalid FGA audit Handler
ORA-28138 Error in Policy Predicate
ORA-28139 Maximum allowed Fine Grain Audit Policies Exceeded
ORA-28140 Invalid column specified
ORA-28141 error in creating audit index file
ORA-28142 error in accessing audit index file
ORA-28143 Invalid argument passed to FGA ADD_POLICY procedure
ORA-28144 Failed to execute fine-grained audit handler
ORA-28150 proxy not authorized to connect as client
ORA-28151 more than one user name specified for command
ORA-28152 proxy user 'string' may not specify initial role 'string' on behalf of client 'string'
ORA-28153 Invalid client initial role specified: 'string'
ORA-28154 Proxy user may not act as client 'string'
ORA-28155 user 'string' specified as a proxy is actually a role
ORA-28156 Proxy user 'string' not authorized to set role 'string' for client 'string'
ORA-28157 Proxy user 'string' forbidden to set role 'string' for client 'string'
ORA-28163 GRANT already specified
ORA-28164 REVOKE already specified
ORA-28165 proxy 'string' may not specify password-protected role 'string' for client 'string'
ORA-28166 duplicate rolename in list
ORA-28168 attempted to grant password-protected role
ORA-28169 unsupported certificate type
ORA-28170 unsupported certificate version
ORA-28171 unsupported Kerberos version
ORA-28172 distinguished name not provided by proxy
ORA-28173 certificate not provided by proxy
ORA-28174 Kerberos ticket not provided by proxy
ORA-28175 incorrect certificate type
ORA-28176 incorrect certificate version
ORA-28177 incorrect Kerberos ticket version
ORA-28178 password not provided by proxy
ORA-28179 client user name not provided by proxy
ORA-28180 multiple authentication methods provided by proxy
ORA-28181 proxy 'string' failed to enable one or more of the specified initial roles for client 'string'
ORA-28182 cannot acquire Kerberos service ticket for client
ORA-28183 proper authentication not provided by proxy
ORA-28184 global user cannot have proxy permissions managed in the directory
ORA-28200 IDENTIFIED USING already specified
ORA-28221 REPLACE not specified
ORA-28223 first login requires password change
ORA-28231 no data passed to obfuscation toolkit
ORA-28232 invalid input length for obfuscation toolkit
ORA-28233 double encryption not supported
ORA-28234 key length too short
ORA-28235 algorithm not available
ORA-28236 invalid Triple DES mode
ORA-28237 seed length too short
ORA-28238 no seed provided
ORA-28239 no key provided
ORA-28261 CURRENT_USER can not be used in PLSQL Definer's Right procedure.
ORA-28262 global_context_pool_size has invalid value.
ORA-28263 Insufficient memory in global context pool
ORA-28264 Client identifier is too long
ORA-28265 NameSpace beginning with 'sys_' is not allowed
ORA-28267 Invalid NameSpace Value
ORA-28268 Exceeded the maximum allowed size for Context information in a session
ORA-28270 Malformed user nickname for password authenticated global user.
ORA-28271 No permission to read user entry in LDAP directory service.
ORA-28272 Domain policy restricts password based GLOBAL user authentication.
ORA-28273 No mapping for user nickname to LDAP distinguished name exists.
ORA-28274 No ORACLE password attribute corresponding to user nickname exists.
ORA-28275 Multiple mappings for user nickname to LDAP distinguished name exist.
ORA-28276 Invalid ORACLE password attribute.
ORA-28277 LDAP search, while authenticating global user with passwords, failed.
ORA-28278 No domain policy registered for password based GLOBAL users.
ORA-28279 Error reading ldap_directory_access init parameter.
ORA-28280 Multiple entries for ORACLE database password exist.
ORA-28281 Global application context is not updated on one or more Oracle RAC instances
ORA-28290 Multiple entries found for the same Kerberos Principal Name
ORA-28291 No Kerberos Principal Value found.
ORA-28292 No Domain Policy registered for Kerberos based authentication
ORA-28293 No matched Kerberos Principal found in any user entry
ORA-28300 No permission to read user entry in LDAP directory service.
ORA-28301 Domain Policy hasn't been registered for SSL authentication.
ORA-28302 User does not exist in the LDAP directory service.
ORA-28303 Distinguished name for user exceeds maximum supported length
ORA-28330 encryption is not allowed for this data type
ORA-28331 encrypted column size too long for its data type
ORA-28332 cannot have more than one password for the encryption key
ORA-28333 column is not encrypted
ORA-28334 column is already encrypted
ORA-28335 referenced or referencing FK constraint column cannot be encrypted
ORA-28336 cannot encrypt SYS owned objects
ORA-28337 the specified index may not be defined on an encrypted column
ORA-28338 Column(s) cannot be both indexed and encrypted with salt
ORA-28339 missing or invalid encryption algorithm
ORA-28340 a different encryption algorithm has been chosen for the table
ORA-28341 cannot encrypt constraint column(s) with salt
ORA-28342 integrity check fails on column key
ORA-28343 fails to encrypt data
ORA-28344 fails to decrypt data
ORA-28345 cannot downgrade because there exists encrypted column
ORA-28346 an encrypted column cannot serve as a partitioning column
ORA-28347 encryption properties mismatch
ORA-28348 index defined on the specified column cannot be encrypted
ORA-28349 cannot encrypt the specified column recorded in the materialized view log
ORA-28350 cannot encrypt the specified column recorded in CDC synchronized change table
ORA-28351 cannot encrypt the column of a cluster key
ORA-28353 failed to open wallet
ORA-28354 Encryption wallet, auto login wallet, or HSM is already open
ORA-28356 invalid open wallet syntax
ORA-28357 password required to open the wallet
ORA-28358 improper set key syntax
ORA-28359 invalid certificate identifier
ORA-28361 master key not yet set
ORA-28362 master key not found
ORA-28363 buffer provided not large enough for output
ORA-28364 invalid wallet operation
ORA-28365 wallet is not open
ORA-28366 invalid database encryption operation
ORA-28367 wallet does not exist
ORA-28368 cannot auto-create wallet
ORA-28369 cannot add files to encryption-ready tablespace when offline
ORA-28370 ENCRYPT storage option not allowed
ORA-28371 ENCRYPTION clause and/or ENCRYPT storage option not allowed
ORA-28372 missing ENCRYPT storage option for encrypted tablespace
ORA-28373 missing ENCRYPTION clause for encrypted tablespace
ORA-28374 typed master key not found in wallet
ORA-28375 cannot perform cross-endianism conversion on encrypted tablespace
ORA-28376 cannot find PKCS11 library
ORA-28377 No need to migrate from wallet to HSM
ORA-28378 Wallet not open after setting the Master Key
ORA-28379 a different integrity algorithm has been chosen for the table
ORA-28382 Global wallet operation in RAC failed
ORA-28383 cannot do a PKI certificate-based Master Key migration
ORA-28384 cannot perform Tablespace Encryption
ORA-28385 cannot perform a PKI certificate-based migration
ORA-28386 cannot perform a PKI certificate-based Master Key Rekey
ORA-28387 Could not acquire an enqueue for wallet operation in Oracle RAC
ORA-28388 database is not open in read/write mode
ORA-28389 cannot close auto login wallet
ORA-28390 auto login wallet not open but encryption wallet may be open
ORA-28391 cannot close wallet or HSM, password mismatch
ORA-28392 invalid close wallet syntax
ORA-28393 password required to close the wallet
ORA-28394 decryption of data of length string failed
ORA-28395 could not write the new master key to the wallet
ORA-28396 rekey of enc$ dictionary table failed
ORA-28397 cannot online file string since it has a passphrase-wrapped key
ORA-28398 cannot rewrap encryption key for this file
ORA-28403 file string cannot be modified because it is an online data file
ORA-28404 role cannot be altered
ORA-28405 cannot grant secure role to a role
ORA-28407 Hardware Security Module error detected
ORA-28408 encryption using passphrase failed
ORA-28409 decryption using passphrase failed
ORA-28500 connection from ORACLE to a non-Oracle system returned this message:
ORA-28501 communication error on heterogeneous database link
ORA-28502 internal communication error on heterogeneous database link
ORA-28503 bind value cannot be translated into SQL text for non-Oracle system
ORA-28504 ROWID not found in ROWID cache for heterogeneous database link
ORA-28505 cannot get non-Oracle system capabilities from string
ORA-28506 parse error in data dictionary translation for string stored in string
ORA-28507 error in data dictionary view string
ORA-28508 invalid value string for Heterogeneous Services initialization parameter string
ORA-28509 unable to establish a connection to non-Oracle system
ORA-28510 heterogeneous database link initialization failed
ORA-28511 lost RPC connection to heterogeneous remote agent using SID=string
ORA-28512 cannot get data dictionary translations from string
ORA-28513 internal error in heterogeneous remote agent
ORA-28514 heterogeneous database link initialization could not convert system date
ORA-28515 cannot get external object definitions from string
ORA-28518 data dictionary translation has illegal translation type
ORA-28519 no heterogeneous data dictionary translations available
ORA-28520 error initializing heterogeneous data dictionary translations
ORA-28521 no heterogeneous capability information available
ORA-28522 error initializing heterogeneous capabilities
ORA-28523 ORACLE and heterogeneous agent are incompatible versions
ORA-28525 unable to create Heterogeneous Services error message text
ORA-28526 invalid describe information returned to Heterogeneous Services
ORA-28527 Heterogeneous Services datatype mapping error
ORA-28528 Heterogeneous Services datatype conversion error
ORA-28529 invalid or missing parameter in Net8 service name definition
ORA-28530 Heterogeneous Services initialization error in NLS language ID
ORA-28533 Heterogeneous Services coercion handling error
ORA-28534 Heterogeneous Services preprocessing error
ORA-28535 invalid Heterogeneous Services context
ORA-28536 error in processing Heterogeneous Services initialization parameters
ORA-28537 no more result sets
ORA-28538 result set not found
ORA-28539 gateway does not support result sets
ORA-28540 internal result set error
ORA-28541 Error in HS init file on line number.
ORA-28542 Error in reading HS init file
ORA-28543 Error initializing apply connection to non-Oracle system
ORA-28544 connect to agent failed, probable Net8 administration error
ORA-28545 error diagnosed by Net8 when connecting to an agent
ORA-28546 connection initialization failed, probable Net8 admin error
ORA-28547 connection to server failed, probable Oracle Net admin error
ORA-28550 pass-through SQL: cursor not found
ORA-28551 pass-through SQL: SQL parse error
ORA-28552 pass-through SQL: call flow error
ORA-28553 pass-through SQL: invalid bind-variable position
ORA-28554 pass-through SQL: out of cursors
ORA-28555 pass-through SQL: required parameter missing or NULL
ORA-28556 authorization insufficient to access table
ORA-28557 unknown string for database link to non-Oracle system
ORA-28558 HS_FDS_CONNECT_STRING undefined for non-Oracle system
ORA-28559 FDS_CLASS_NAME is string, FDS_INST_NAME is string
ORA-28560 error in configuration of agent process
ORA-28561 unable to set date format on non-Oracle system
ORA-28562 Heterogeneous Services data truncation error
ORA-28575 unable to open RPC connection to external procedure agent
ORA-28576 lost RPC connection to external procedure agent
ORA-28577 argument string of external procedure string has unsupported datatype string
ORA-28578 protocol error during callback from an external procedure
ORA-28579 network error during callback from external procedure agent
ORA-28580 recursive external procedures are not supported
ORA-28581 protocol error while executing recursive external procedure
ORA-28582 a direct connection to this agent is not allowed
ORA-28583 remote references are not permitted during agent callbacks
ORA-28584 heterogeneous apply internal error
ORA-28590 agent control utility: illegal or badly formed command
ORA-28591 agent control utility: unable to access parameter file
ORA-28592 agent control utility: agent SID not set
ORA-28593 agent control utility: command terminated with error
ORA-28594 agent control utility: invalid parameter name
ORA-28595 Extproc agent : Invalid DLL Path
ORA-28601 invalid [no]MINIMIZE option
ORA-28602 statement not permitted on tables containing bitmap indexes
ORA-28603 statement not permitted on empty tables
ORA-28604 table too fragmented to build bitmap index (string,string,string)
ORA-28605 bitmap indexes cannot be reversed
ORA-28606 block too fragmented to build bitmap index (string,string)
ORA-28611 bitmap index is corrupted - see trace file for diagnostics
ORA-28650 Primary index on an IOT cannot be rebuilt
ORA-28651 Primary index on IOTs can not be marked unusable
ORA-28652 overflow segment attributes cannot be specified
ORA-28653 tables must both be index-organized
ORA-28654 table and partition not overflow compatible
ORA-28655 Alter table add overflow syntax error
ORA-28656 incomplete attribute specification
ORA-28658 This operation is supported only for Index-Organized tables
ORA-28659 COMPRESS must be specified at object level first
ORA-28660 Partitioned Index-Organized table may not be MOVEd as a whole
ORA-28661 Object already has COMPRESS clause specified
ORA-28662 IOT index and overflow segments must share the same LOGGING attribute
ORA-28663 Logging/Nologging attribute can not be specified in the statement ALTER TABLE ADD OVERFLOW
ORA-28664 a partitioned table may not be coalesced as a whole
ORA-28665 table and partition must have same compression attribute
ORA-28666 option not allowed for an index on UROWID column(s)
ORA-28667 USING INDEX option not allowed for the primary key of an IOT
ORA-28668 cannot reference mapping table of an index-organized table
ORA-28669 bitmap index can not be created on an IOT with no mapping table
ORA-28670 mapping table cannot be dropped due to an existing bitmap index
ORA-28671 UPDATE BLOCK REFERENCES may not be used on a partitioned index as a whole
ORA-28672 UPDATE BLOCK REFERENCES may not be used on a global index
ORA-28673 Merge operation not allowed on an index-organized table
ORA-28674 cannot reference transient index-organized table
NZE-28750 unknown error
NZE-28751 memory allocation failure
NZE-28752 data source initialization failure
NZE-28753 failure to terminate use of data source
NZE-28754 object storage failure
NZE-28755 object retrieval failure
NZE-28756 callback failure to allocate memory
NZE-28757 system attempt to allocate 0 bytes of memory
NZE-28758 memory release failure
NZE-28759 failure to open file
NZE-28760 list creation failure
NZE-28761 element creation failure
NZE-28762 failure to add element
NZE-28763 Invalid parameter type found in configuration file.
NZE-28764 failure to retrieve a configuration parameter
NZE-28765 Data method list does not exist.
NZE-28766 failure to terminate use of data source
NZE-28767 invalid version number
NZE-28768 bad magic number
NZE-28769 Specified method does not exist.
NZE-28770 Data source is already initialized.
NZE-28771 Data source is not yet initialized.
NZE-28772 invalid file ID
NZE-28773 failure to write magic and version numbers
NZE-28774 file cannot write to disk
NZE-28775 file cannot close
NZE-28776 Output buffer supplied is too small.
NZE-28777 binding creation failure
NZE-28778 Configuration parameter is not specified in the proper format.
NZE-28779 no data access method specified in parameter
NZE-28780 invalid data access method specified by the parameter
NZE-28781 No data for the access method is specified in the parameter.
NZE-28782 data source is not allocated
NZE-28783 invalid parameter
NZE-28784 file name translation failure
NZE-28785 parameter does not exist
NZE-28786 decryption of encrypted private key failure
NZE-28787 private key encryption failure
NZE-28788 user provided invalid information, or an unknown error
NZE-28789 name type not found
NZE-28790 NLS string open failure
NZE-28791 certificate verification failure
NZE-28792 PL/SQL operation failure
NZE-28793 variable bind failure
NZE-28794 data type attribute did not initialize
NZE-28795 data type attribute did not terminate
NZE-28796 access method is not supported
NZE-28797 invalid key data type
NZE-28798 Number of sub-keys application passes to bind does not match that in the key.
NZE-28799 failure to allocate shared memory
NZE-28800 data source failed to open
NZE-28801 invalid object type
NZE-28802 invalid mode or data source in configuration file
NZE-28803 I/O operation failure
NZE-28804 Data source cannot close.
NZE-28805 Cannot retrieve information from the data source.
NZE-28806 Cannot write to the data source.
NZE-28807 Cannot update the data source.
NZE-28808 Cannot retrieve method information from the configuration file.
NZE-28809 Cannot delete information from the data source.
NZE-28810 Cannot create key descriptor.
NZE-28811 invalid access descriptor
NZE-28812 record operation failure
NZE-28813 invalid record type
NZE-28814 Cannot convert a number in Oracle format to native format.
NZE-28815 Cannot convert a number in native format to Oracle format.
NZE-28816 No password provided for a PL/SQL function.
NZE-28817 PL/SQL function returned an error.
NZE-28818 No package context provided.
NZE-28819 No distinguished name provided.
NZE-28820 Signature or decryption/encryption state is not provided.
NZE-28821 No input buffer provided.
NZE-28822 Required seed is not specified.
NZE-28823 Number of random bytes to generate is not specified.
NZE-28824 invalid encryption/decryption/signature state passed
NZE-28825 No cryptographic engine function specified.
NZE-28826 invalid cryptographic engine function passed
NZE-28827 invalid cipher type passed
NZE-28828 invalid identity type passed
NZE-28829 no cipher type specified
NZE-28830 no identity type specified
NZE-28831 no data unit format
NZE-28832 invalid data unit format
NZE-28833 inadequate information provided
NZE-28834 Buffer is too small.
NZE-28835 Identity descriptor is not present or is too small.
NZE-28836 Wallet is not open.
NZE-28837 no wallet descriptor
NZE-28838 no identity descriptor
NZE-28839 no persona descriptor
NZE-28840 Wallet is already open.
NZE-28841 Operation is not supported.
NZE-28842 Incorrect file permissions
NZE-28843 Operating system error while creating/opening file
NZE-28844 No wallet present
NZE-28845 No certificate
NZE-28846 No private key
NZE-28847 No clear private key file
NZE-28848 No encrypted private key file
NZE-28849 No Trustpoints
NZE-28852 Bad password
NZE-28853 Initialization failure
NZE-28854 Memory allocation failure
NZE-28855 Unsupported SSL operation
NZE-28856 Buffer overflow error
NZE-28857 Unknown SSL error
NZE-28858 SSL protocol error
NZE-28859 SSL negotiation failure
NZE-28860 Fatal SSL error
NZE-28861 SSL connection would block
NZE-28862 SSL connection failed
NZE-28863 SSL session not found
NZE-28864 SSL connection closed gracefully
NZE-28865 SSL connection closed
NZE-28866 Invalid peer certificate encoding
NZE-28867 Integer value is too big.
NZE-28868 Peer certificate chain check failed.
NZE-28869 Peer's certificate is expired.
NZE-28870 Name comparison failure
NZE-28871 Peer certificate chain is incomplete.
NZE-28872 Invalid peer certificate format
NZE-28873 Invalid parameter
NZE-28874 SSL: I/O closed - override goodbye kiss
NZE-28875 SSL: use server-gated cryptographic suites
NZE-28884 invalid cipher suite
NZE-28885 No certificate with the required key usage found.
NZE-28890 Entrust Login Failed
NZE-29000 Certificate not installed
NZE-29002 SSL transport detected invalid or obsolete server certificate.
NZE-29003 SSL transport detected mismatched server certificate.
NZE-29004 Callback Failure
NZE-29005 The certificate is invalid.
NZE-29006 The certificate request message is invalid when using SSL 2.0.
NZE-29007 Bad Clear Key Length when using SSL 2.0
NZE-29008 Bad DH Param key length
NZE-29009 Bad encrypted key length when using SSL 2.0
NZE-29010 Export key length does not meet export restrictions.
NZE-29011 Finished message is incorrect.
NZE-29012 Bad key argument length when using SSL 2.0
NZE-29013 SSL MAC verification failure
NZE-29014 Maximum fragment length extension is incorrect.
NZE-29015 incorrect message length
NZE-29016 inadequate PKCS1 message padding
NZE-29017 The premaster secret length is incorrect.
NZE-29018 The premaster secret contains an incorrect version number.
NZE-29019 The protocol version is incorrect.
NZE-29020 The handshake record length is too long.
NZE-29021 Secret key length is incorrect when using SSL 2.0.
NZE-29022 Operation is being attempted on the wrong side of the client/server connection.
NZE-29023 The buffers are not empty.
NZE-29024 Certificate validation failure
NZE-29025 Error found in certificate check callback.
NZE-29026 Decryption failure
NZE-29027 Error in entropy collection
NZE-29028 Server verification failure when using SSL 2.0
NZE-29029 SSL handshake already completed
NZE-29030 SSL handshake is requested.
NZE-29031 SSL handshake is required.
NZE-29032 The given identity is not complete.
NZE-29033 Invalid PFX
NZE-29034 Correct cipher suite or client authentication is needed.
NZE-29035 Pseudo Random Number Generator is needed
NZE-29036 This feature is not supported
NZE-29037 No certificate is present
NZE-29038 There are no matching certificates.
NZE-29039 There are no matching cipher suites.
NZE-29040 There are no supported cipher suites.
NZE-29041 The callback is NULL.
NZE-29042 Read buffer is not empty.
NZE-29043 Read is required.
NZE-29044 Renegotiation has already been requested.
NZE-29045 Renegotiation request has been refused.
NZE-29046 Session is resumable.
NZE-29047 Mismatch in Transport Layer Security extension
NZE-29048 Unexpected message received.
NZE-29049 Unknown record
NZE-29050 Installed client authentication mode is not supported.
NZE-29051 The given public key type is not supported.
NZE-29052 Write buffer is not empty.
NZE-29084 The parameter specified is illegal.
NZE-29095 Index is not correct.
NZE-29096 The given length is incorrect.
NZE-29100 Cannot create local key ID.
NZE-29101 Cannot add private key bag.
NZE-29102 Cannot add certificate bag.
NZE-29103 Cannot create PKCS #12 wallet.
NZE-29104 Cannot add certificate request.
NZE-29105 Cannot export PKCS #12 wallet.
NZE-29106 Cannot import PKCS #12 wallet.
NZE-29107 Cannot create PKCS #12 wallet.
NZE-29108 Cannot initialize random object.
NZE-29109 Cannot create private key object.
NZE-29110 Invalid PKCS #12 bag type
NZE-29111 Invalid index
NZE-29112 Cannot access attributes from a PKCS #12 certificate bag.
NZE-29113 Cannot access attributes from a PKCS #12 key bag.
NZE-29114 Cannot import private key.
NZE-29115 Cannot export private key.
NZE-29116 Cannot get PKCS #12 attributes.
NZE-29117 Cannot add PKCS #12 attributes.
NZE-29118 Cannot create PKCS #12 attributes.
NZE-29119 Cannot import certificate.
NZE-29120 Cannot export certificate.
NZE-29122 could not add pkcs11 info to the pkcs12 wallet
NZE-29123 could not get pkcs11 info from the pkcs12 wallet
NZE-29124 pkcs11 library name already set
NZE-29125 pkcs11 token label already set
NZE-29126 pkcs11 token passphrase already set
NZE-29127 unknown pkcs11 information
NZE-29128 pkcs11 library name not set
NZE-29129 pkcs11 token label not set
NZE-29130 pkcs11 token passphrase not set
NZE-29131 pkcs11 certificate label already set in wallet
NZE-29135 Seed generation for Random Number Generator failed.
NZE-29136 The allocated buffer is too small.
NZE-29137 The global context is incorrect.
NZE-29140 Cannot create certificate object.
NZE-29141 Cannot import in the der format.
NZE-29150 DES self-test failure
NZE-29151 3DES self-test failure
NZE-29152 SHA-1 self-test failure
NZE-29153 RSA self-test failure
NZE-29154 deterministic RNG self-test failure
NZE-29155 continuous key pair consistency check self-test failure
NZE-29156 conditional RNG self-test failure
NZE-29157 Unable to build an absolute path to the library.
NZE-29158 Unable to open library.
NZE-29159 Unable to read library.
NZE-29160 NZ library being used is different.
NZE-29161 software integrity self-test failure
NZE-29162 Non-FIPS cipher suites being used in FIPS mode.
NZE-29163 Third party PKI vendor is not supported in FIPS mode.
NZE-29164 External PKCS #12 wallet is not supported in FIPS mode.
NZE-29176 CRL signature verification failed
NZE-29177 certificate serial number is not in CRL
NZE-29178 certificate serial number is in CRL
NZE-29179 certificate validation check failed
NZE-29180 Unsupported validation protocol
NZE-29181 ldap_open failed
NZE-29182 ldap_bind failed
NZE-29183 ldap_search failed
NZE-29184 ldap_result failed
NZE-29185 ldap_first_attribute failed
NZE-29186 ldap_get_values_len failed
NZE-29187 unsupported validation mechanism
NZE-29188 ldap_count_entries failed
NZE-29189 No entry found in OID
NZE-29190 Multiple entries in OID
NZE-29191 OID connection information not set
NZE-29192 Validation mechanism not set in OID
NZE-29193 no CRL found using CRLDP mechanism
NZE-29194 no CRL found in cache
NZE-29195 CRL is expired
NZE-29222 Distinguished name does not match.
NZE-29223 Cannot create certificate chain.
NZE-29224 Cannot locate matching certificate request.
NZE-29225 Certificate already installed.
NZE-29226 No matching private key found.
NZE-29227 Certificate is expired.
NZE-29228 Cannot calculate the number of bytes for output.
NZE-29229 the magic number found in the header does not match expected
NZE-29230 the header length is not sufficient for message header
NZE-29231 the cryptographic engine failed to initialize
NZE-29232 the cryptographic engine key initialization failed
NZE-29233 the key object could not be encoded
NZE-29234 a key object was not extracted from encoding
NZE-29235 the key information could not be retrieved
NZE-29236 the random number generator will not accept seed
NZE-29237 the cryptographic engine could not finish the algorithm
NZE-29238 the cryptographic engine could not apply the algorithm
NZE-29239 the cryptographic engine could not initialize the algorithm
NZE-29240 the cryptographic engine does not recognize the algorithm
NZE-29241 a buffer block needs more space but its length is fixed
NZE-29242 the asymmetric key is too short to be used with the data.
NZE-29243 the toolkit does not recognize the type of key being used
NZE-29245 the toolkit does not recognize the function being used
NZE-29246 the toolkit could not parse the tdu
NZE-29247 an unopen toolkit object was used before it was opened
NZE-29248 an unrecognized WRL was used to open a wallet
NZE-29249 an unrecognized state was passed to a cryptographic function
ORA-29250 Invalid index specifed in call to dbms_sql.bind_array
ORA-29251 Index1 is greater than Index2 in call to dbms_sql.bind_array
ORA-29252 collection does not contain elements at index locations in call to dbms_sql.bind_array
ORA-29253 Invalid count argument passed to procedure dbms_sql.define_array
ORA-29254 Invalid lower_bound argument passed to procedure dbms_sql.define_array
ORA-29255 Cursor contains both bind and define arrays which is not permissible
ORA-29256 Cursor contains both regular and array defines which is illegal
ORA-29257 host string unknown
ORA-29258 buffer too small
ORA-29259 end-of-input reached
ORA-29260 network error: string
ORA-29261 bad argument
ORA-29262 bad URL
ORA-29263 HTTP protocol error
ORA-29264 unknown or unsupported URL scheme
ORA-29265 HTTP header not found
ORA-29266 end-of-body reached
ORA-29267 illegal call
ORA-29268 HTTP client error string
ORA-29269 HTTP server error string
ORA-29270 too many open HTTP requests
ORA-29271 not connected
ORA-29272 initialization failed
ORA-29273 HTTP request failed
ORA-29274 fixed-width multibyte character set not allowed for a URL
ORA-29275 partial multibyte character
ORA-29276 transfer timeout
ORA-29277 invalid SMTP operation
ORA-29278 SMTP transient error: string
ORA-29279 SMTP permanent error: string
ORA-29280 invalid directory path
ORA-29281 invalid mode
ORA-29282 invalid file ID
ORA-29283 invalid file operation
ORA-29284 file read error
ORA-29285 file write error
ORA-29286 internal error
ORA-29287 invalid maximum line size
ORA-29288 invalid file name
ORA-29289 directory access denied
ORA-29290 invalid offset specified for seek
ORA-29291 file remove operation failed
ORA-29292 file rename operation failed
ORA-29293 A stream error occurred during compression or uncompression.
ORA-29294 A data error occurred during compression or uncompression.
ORA-29295 invalid mime header tag
ORA-29296 invalid encoded string
ORA-29297 The compressed representation is too big
ORA-29298 Character set mismatch
ORA-29299 Invalid handle for piecewise compress or uncompress
ORA-29300 ORACLE error, tablespace point-in-time recovery
ORA-29301 wrong DBMS_PITR package function/procedure order
ORA-29302 database is not open clone
ORA-29303 user does not login as SYS
ORA-29304 tablespace 'string' does not exist
ORA-29305 cannot point-in-time recover tablespace 'string'
ORA-29306 datafile string is not online
ORA-29307 datafile string error, string
ORA-29308 view TS_PITR_CHECK failure
ORA-29309 export dump file was generated by different version of DBMS_PITR package
ORA-29310 database is not open, or opened as a clone
ORA-29311 export dump file was not generated by this database, string does not match
ORA-29313 tablespace 'string' cannot be imported twice
ORA-29314 tablespace 'string' is not OFFLINE FOR RECOVER nor READ ONLY
ORA-29315 tablespace 'string' has been recreated
ORA-29316 datafile string been imported twice
ORA-29317 datafile string does not exist
ORA-29318 datafile string is online
ORA-29319 datafile string is not correct
ORA-29320 datafile header error
ORA-29321 too many datafiles added since the point-in-time
ORA-29322 SCN string size too long -- maximum size 58 bytes/characters
ORA-29323 ALTER DATABASE SET COMPATIBILITY command not supported by string
ORA-29324 SET COMPATIBILITY release string format is wrong
ORA-29325 SET COMPATIBILITY release number lower than string
ORA-29326 SET COMPATIBILITY release number higher than string
ORA-29327 unsupported client compatibility mode used when talking to the server
ORA-29328 too many datafiles in this tablespace 'string'
ORA-29329 Table not of type XMLType
ORA-29330 Source script length too big
ORA-29335 tablespace 'string' is not read only
ORA-29336 Internal error [string] [string] from DBMS_PLUGTS
ORA-29337 tablespace 'string' has a non-standard block size (string)
ORA-29338 datafile string is in an undesired state (string, string)
ORA-29339 tablespace block size string does not match configured block sizes
ORA-29340 export file appears to be corrupted: [string] [string] [string]
ORA-29341 The transportable set is not self-contained
ORA-29342 user string does not exist in the database
ORA-29343 user string (mapped from user string) does not exist in the database
ORA-29344 Owner validation failed - failed to match owner 'string'
ORA-29345 cannot plug a tablespace into a database using an incompatible character set
ORA-29346 invalid tablespace list
ORA-29347 Tablespace name validation failed - failed to match tablespace 'string'
ORA-29348 You must specify the datafiles to be plugged in
ORA-29349 tablespace 'string' already exists
ORA-29351 can not transport system, sysaux, or temporary tablespace 'string'
ORA-29352 event 'string' is not an internal event
ORA-29353 The transportable list is too long.
ORA-29355 NULL or invalid string argument specified
ORA-29356 These parameters can be specified only for directives that refer to consumer groups
ORA-29357 object string already exists
ORA-29358 resource plan string does not exist
ORA-29359 invalid method name string specified for resource plan string
ORA-29360 resource plan string contains multiple directives for subplan string
ORA-29361 value string is outside valid range of 0 to 100
ORA-29362 plan directive string, string does not exist
ORA-29363 plan directive string, string is mandatory and cannot be modified or deleted
ORA-29364 plan directive string, string already exists
ORA-29365 parameters string and string cannot both be set
ORA-29366 invalid CONSUMER_GROUP argument specified
ORA-29367 object string does not exist
ORA-29368 consumer group string does not exist
ORA-29369 invalid method name string specified for consumer group string
ORA-29370 pending area is already active
ORA-29371 pending area is not active
ORA-29372 identifier string is too long; it must be less than string characters
ORA-29373 resource manager is not on
ORA-29374 resource plan string in top-plan string has no plan directives
ORA-29375 sum of values string for level string, plan string exceeds string
ORA-29376 number of consumer groups string in plan string exceeds string
ORA-29377 consumer group string is not part of top-plan string
ORA-29378 invalid consumer group mapping priorities
ORA-29379 resource plan string is involved in a loop in top-plan string
ORA-29380 resource plan string is currently active and cannot be deleted
ORA-29381 plan/consumer_group string referred to by another plan and cannot be deleted
ORA-29382 validation of pending area failed
ORA-29383 all leaves of top-plan string must be consumer groups
ORA-29384 number of consumer groups and subplans for plan string exceeds string
ORA-29385 cannot create plan directive from string to string
ORA-29386 plan or consumer group string is mandatory and cannot be deleted or modified
ORA-29387 no top-plans found in the pending area
ORA-29388 plan/consumer_group string is part of more than one top-plan
ORA-29389 too many errors during validation
ORA-29390 some resource plans are not part of any top-plan
ORA-29391 string and string must be mandatory to create a mandatory plan directive
ORA-29392 cpu parameters for level string for plan string must be zero
ORA-29393 user string does not exist or is not logged on
ORA-29394 session id string and serial# string do not exist
ORA-29395 cannot set the initial consumer group to string
ORA-29396 cannot switch group to string
ORA-29397 cannot grant/revoke switch privilege for string
ORA-29398 invalid privilege name specified
ORA-29399 user string does not have privilege to switch to consumer group string
ORA-29400 data cartridge error string
ORA-29470 Effective userid or roles are not the same as when cursor was parsed
ORA-29471 DBMS_SQL access denied
ORA-29472 DBMS_SQL.OPEN_CURSOR failed. security_level is outside the valid range of 0 to 2
ORA-29473 privilege checking level specified for 'string' must be between 0 and 2
ORA-29474 DBMS_SQL.OPEN_CURSOR failed. security_level of 0 is not allowed
ORA-29475 useLogonRoles=>TRUE not permitted with userid=>NULL
ORA-29477 SQL statement size in bytes is too big
ORA-29490 insufficient privilege
ORA-29491 invalid table for chunking
ORA-29492 invalid state for create chunk
ORA-29493 invalid status
ORA-29494 invalid state for run task
ORA-29495 invalid state for resume task
ORA-29496 Parameter [string] is null or its value length exceeds the maximum limit [string]
ORA-29497 duplicate task name
ORA-29498 task not found
ORA-29499 chunk not found
ORA-29500 NAMED keyword is invalid in CREATE JAVA CLASS
ORA-29501 invalid or missing Java source, class, or resource name
ORA-29502 NAMED keyword required in CREATE JAVA RESOURCE
ORA-29503 SCHEMA keyword not valid with NAMED keyword
ORA-29504 invalid or missing schema name
ORA-29505 AS keyword is invalid in CREATE JAVA CLASS or RESOURCE
ORA-29506 invalid query derived from USING clause
ORA-29507 query derived from USING clause found zero or many rows
ORA-29508 query derived from USING clause did not select a value of type string
ORA-29509 incorrectly formed Java binary class definition
ORA-29510 name, string.string, already used by an existing object
ORA-29511 could not resolve Java class
ORA-29512 incorrectly formed name resolver specification
ORA-29513 referenced class name too long
ORA-29514 class name contains illegal character
ORA-29515 exit called from Java code with status string
ORA-29516 Aurora assertion failure: string
ORA-29517 recursive resolution failed for a referenced class
ORA-29518 name string resolved to an object in schema string that is not a Java class
ORA-29519 name string resolved via a synonym in schema string to a class with a different name
ORA-29520 name string resolved to a class in schema string that could not be accessed
ORA-29521 referenced name string could not be found
ORA-29522 authorization error for referenced name string.string
ORA-29523 authorization error for unknown referenced name
ORA-29524 wrong types of arguments in call to 'string'
ORA-29525 referenced name is too long: 'string'
ORA-29526 created Java class string"string"
ORA-29527 created Java source string"string"
ORA-29528 invalid Java call in trigger string
ORA-29529 invalid function or method call string in trigger string
ORA-29530 could not create shortened name for string
ORA-29531 no method string in class string
ORA-29532 Java call terminated by uncaught Java exception: string
ORA-29533 attempt to overwrite class or resource string while defining or compiling string.string
ORA-29534 referenced object string.string could not be resolved
ORA-29535 source requires recompilation
ORA-29536 badly formed source: string
ORA-29537 class or resource cannot be created or dropped directly
ORA-29538 Java not installed
ORA-29539 Java system classes already installed
ORA-29540 class string does not exist
ORA-29541 class string.string could not be resolved
ORA-29542 class string already defined by source string
ORA-29543 Java command string not yet implemented
ORA-29544 invalid type
ORA-29545 badly formed class: string
ORA-29546 badly formed resource: string
ORA-29547 Java system class not available: string
ORA-29548 Java system class reported: string
ORA-29549 class string.string has changed, Java session state cleared
ORA-29550 Java session state cleared
ORA-29551 could not convert string to Unicode
ORA-29552 verification warning: string
ORA-29553 class in use: string.string
ORA-29554 unhandled Java out of memory condition
ORA-29555 Java source, class or resource is not allowed here
ORA-29556 object type has changed
ORA-29557 Java system class string cannot be modified
ORA-29558 JAccelerator (NCOMP) not installed. Refer to Install Guide for instructions.
ORA-29561 Java VM JIT not supported on this platform.
ORA-29655 USING clause is incompatible with its supertype
ORA-29656 Invalid option for USING
ORA-29657 class defined in EXTERNAL NAME clause is used in another subtype
ORA-29658 EXTERNAL NAME clause is not compatible with its supertype
ORA-29659 SQLJ Object Type validation failed to get default connection
ORA-29660 Unable to find the class defined in the EXTERNAL NAME clause
ORA-29661 Unable to find the superclass of the defined in the EXTERNAL NAME
ORA-29662 Unable to find a field that matches one or more of the attributes
ORA-29663 Unable to find a method that matches one or more of the functions
ORA-29664 Unable to generate the helper class for the defined type
ORA-29665 Java thread deadlock detected
ORA-29701 unable to connect to Cluster Synchronization Service
ORA-29702 error occurred in Cluster Group Service operation
ORA-29703 error occurred in global enqueue service operation
ORA-29704 cannot specify ACTIVE_INSTANCE_COUNT in 8.1.5 or earlier release
ORA-29705 ACTIVE_INSTANCE_COUNT is string which is incompatible with the value in other instances
ORA-29706 incorrect value string for parameter ACTIVE_INSTANCE_COUNT
ORA-29707 inconsistent value string for initialization parameter string with other instances
ORA-29708 error occurred in Cluster Synchronization Services
ORA-29709 Communication failure with Cluster Synchronization Services
ORA-29710 Current operation aborted by Cluster Synchronization Services
ORA-29711 error occurred during registration of Oracle process with CSS
ORA-29735 instance specified no longer exists
ORA-29740 evicted by instance number string, group incarnation string
ORA-29741 IMR active for some, but not all members of cluster
ORA-29742 incompatible Instance Membership Recovery protocol among instances
ORA-29746 Cluster Synchronization Service is being shut down.
ORA-29760 instance_number parameter not specified
ORA-29770 global enqueue process string (OSID string) is hung for more than string seconds
ORA-29771 process string (OSID string) blocks string (OSID string) for more than string seconds
ORA-29780 unable to connect to GPnP daemon [string]
ORA-29783 GPnP attribute SET failed with error [string]
ORA-29784 Attribute update operation not permitted
ORA-29785 GPnP attribute GET failed with error [string]
ORA-29786 SIHA attribute GET failed with error [string]
ORA-29787 SIHA attribute SET failed with error [string]
ORA-29788 Network interface query failed with error [string]
ORA-29790 Cannot change user session parameters for a non-user session
ORA-29791 Transactions cannot be replayed
ORA-29800 invalid name for operator
ORA-29801 missing RETURN keyword
ORA-29802 missing CONTEXT keyword
ORA-29803 missing ANCILLARY keyword
ORA-29804 missing DATA keyword
ORA-29805 missing COLUMN keyword
ORA-29806 specified binding does not exist
ORA-29807 specified operator does not exist
ORA-29808 specified primary operator binding does not exist
ORA-29809 cannot drop an operator with dependent objects
ORA-29810 inadequate operator privileges
ORA-29811 missing STATISTICS keyword
ORA-29812 incorrect object name specified
ORA-29813 non-supported object type with associate statement
ORA-29814 expecting USING or DEFAULT keyword
ORA-29815 object being associated is not present
ORA-29816 object being disassociated is not present
ORA-29817 non-supported option with disassociate statement
ORA-29818 column name not properly specified
ORA-29819 cannot associate default values with columns
ORA-29820 the statistics type is not present
ORA-29821 specified primary operator does not exist
ORA-29822 selectivity cannot be specified for the type of object
ORA-29823 object being analyzed is not a table
ORA-29824 operator is invalid
ORA-29825 invalid name for indextype
ORA-29826 keyword FOR is missing
ORA-29827 keyword USING is missing
ORA-29828 invalid name for implementation type
ORA-29829 implementation type does not exist
ORA-29830 operator does not exist
ORA-29831 operator binding not found
ORA-29832 cannot drop or replace an indextype with dependent indexes
ORA-29833 indextype does not exist
ORA-29834 REF datatype not supported with operators
ORA-29835 ODCIGETINTERFACES routine does not return required interface(s)
ORA-29836 failed to validate referenced operators
ORA-29837 insufficient privileges to execute implementation type
ORA-29838 insufficient privileges to execute the operator(s)
ORA-29839 failed to validate implementation type
ORA-29840 indextype and implementation type are not in same schema
ORA-29841 invalid option for ALTER INDEXTYPE
ORA-29842 option not supported with the version string of the indextype interface
ORA-29843 indextype should support atleast one operator
ORA-29844 duplicate operator name specified
ORA-29845 indextype does not support local domain index on string partitioned table
ORA-29846 cannot create a local domain index on a string partitioned table
ORA-29847 cannot create a local domain index on a partitioned index-organized table
ORA-29848 error occurred in the execution of ODCIINDEXMERGEPARTITION routine
ORA-29849 error occurred in the execution of ODCIINDEXSPLITPARTITION routine
ORA-29850 invalid option for creation of domain indexes
ORA-29851 cannot build a domain index on more than one column
ORA-29852 keyword IS is missing
ORA-29853 keyword UNIQUE may not be used in creating domain indexes
ORA-29854 keyword BITMAP may not be used in creating domain indexes
ORA-29855 error occurred in the execution of ODCIINDEXCREATE routine
ORA-29856 error occurred in the execution of ODCIINDEXDROP routine
ORA-29857 domain indexes and/or secondary objects exist in the tablespace
ORA-29858 error occurred in the execution of ODCIINDEXALTER routine
ORA-29859 error occurred in the execution of ODCIINDEXTRUNCATE routine
ORA-29860 cannot truncate a table with domain indexes marked LOADING
ORA-29861 domain index is marked LOADING/FAILED/UNUSABLE
ORA-29862 cannot specify FORCE option for dropping non-domain index
ORA-29863 warning in the execution of ODCIINDEXCREATE routine
ORA-29864 analyzing domain indexes marked LOADING/FAILED not supported
ORA-29865 indextype is invalid
ORA-29866 cannot create domain index on a column of index-organized table
ORA-29867 cannot create a domain index on a LONG column
ORA-29868 cannot issue DDL on a domain index marked as LOADING
ORA-29869 cannot issue ALTER without REBUILD on a domain index marked FAILED
ORA-29870 specified options are only valid for altering a domain index
ORA-29871 invalid alter option for a domain index
ORA-29872 parameters clause cannot be combined with the specified options
ORA-29873 warning in the execution of ODCIINDEXDROP routine
ORA-29874 warning in the execution of ODCIINDEXALTER routine
ORA-29875 failed in the execution of the ODCIINDEXINSERT routine
ORA-29876 failed in the execution of the ODCIINDEXDELETE routine
ORA-29877 failed in the execution of the ODCIINDEXUPDATE routine
ORA-29878 warning in the execution of ODCIINDEXTRUNCATE routine
ORA-29879 cannot create multiple domain indexes on a column list using same indextype
ORA-29880 such column list already indexed using another domain index and indextype
ORA-29881 failed to validate indextype
ORA-29882 insufficient privileges to execute indextype
ORA-29883 cannot create a domain index on column expressions
ORA-29884 domain index is defined on the column to be dropped
ORA-29885 domain index is defined on the column to be modified
ORA-29886 feature not supported for domain indexes
ORA-29887 cannot support row movement if domain index defined on table
ORA-29888 cannot create domain index on a table with row movement enabled
ORA-29890 specified primary operator does not have an index context
ORA-29892 indextypes with array DML do not support the given data type
ORA-29893 indextypes without column data do not need the given data type
ORA-29894 base or varray datatype does not exist
ORA-29895 duplicate base datatype specified
ORA-29896 Length of PARAMETER string longer than string characters
ORA-29900 operator binding does not exist
ORA-29901 function underlying operator binding does not exist
ORA-29902 error in executing ODCIIndexStart() routine
ORA-29903 error in executing ODCIIndexFetch() routine
ORA-29904 error in executing ODCIIndexClose() routine
ORA-29905 method string does not exist in type string.string
ORA-29906 indextype string.string does not exist
ORA-29907 found duplicate labels in primary invocations
ORA-29908 missing primary invocation for ancillary operator
ORA-29909 label for the ancillary operator is not a literal number
ORA-29910 invalid callback operation
ORA-29911 null scan context returned by ODCIIndexStart() routine
ORA-29913 error in executing string callout
ORA-29914 ODCIGETINTERFACES routine does not return required stream version
ORA-29915 cannot select FOR UPDATE from collection operand
ORA-29917 cannot lock a table which gets its rows from a collection operand
ORA-29918 cannot create domain indexes on temporary tables
ORA-29919 failed in the execution of the ODCIINDEXUPDPARTMETADATA routine
ORA-29920 failed in the partition maintenance operation of secondary table
ORA-29921 Ancillary operator not supported with set view query block
ORA-29922 Invalid rowid returned by the user-defined query methods
ORA-29925 cannot execute string
ORA-29926 association already defined for the object
ORA-29927 error in executing the ODCIStatsCollect / ODCIStatsDelete routine
ORA-29928 duplicate default selectivity specified
ORA-29929 missing SCAN Keyword
ORA-29930 COMPUTE ANCILLARY DATA specified without the INDEX CONTEXT clause
ORA-29931 specified association does not exist
ORA-29932 the type being dropped is a statistics type
ORA-29933 object being disassociated has some user defined statistics stored
ORA-29934 index specified for association is not a domain index
ORA-29935 missing FROM keyword
ORA-29936 NULL association is allowed only with a column or an index
ORA-29937 domain index cannot be system-managed
ORA-29938 both indextype and statistics type should be system-managed
ORA-29939 could not implicitly transform user-managed domain index to system-managed domain index
ORA-29950 warning in the execution of ODCIINDEXMERGEPARTITION routine
ORA-29951 warning in the execution of ODCIINDEXSPLITPARTITION routine
ORA-29952 cannot issue DDL on a domain index partition marked as LOADING
ORA-29953 cannot issue DDL on a domain index partition marked as FAILED
ORA-29954 domain index partition is marked LOADING/FAILED/UNUSABLE
ORA-29955 error occurred in the execution of ODCIINDEXEXCHANGEPARTITION routine
ORA-29956 warning in the execution of ODCIINDEXEXCHANGEPARTITION routine
ORA-29957 cannot create a function-based domain index on a string table
ORA-29958 fatal error occurred in the execution of ODCIINDEXCREATE routine
ORA-29959 error in the execution of the string routine for one or more of the index partitions
ORA-29960 line string, string
ORA-29961 too many warnings occurred in the execution of ODCIIndex DDL routine
ORA-29962 fatal error occurred in the execution of ODCIINDEXALTER routine
ORA-29963 missing BINDING keyword
ORA-29964 missing ADD or DROP keyword
ORA-29965 The specified binding does not exist
ORA-29966 The only binding of an operator cannot be dropped
ORA-29967 Cannot drop an operator binding with dependent objects
ORA-29968 No primary operator bindings found for ancillary binding #string
ORA-29970 Specified registration id does not exist
ORA-29971 Specified table name not found or does not have any registrations
ORA-29972 user does not have privilege to change/ create registration
ORA-29973 Unsupported query or operation during change notification registration
ORA-29975 Cannot register a query in the middle of an active transaction
ORA-29976 Unsupported query for registration in guaranteed mode
ORA-29977 Unsupported column type for query registration in guaranteed mode
ORA-29979 Query registration not supported at current compatible setting
ORA-29981 Cannot register query: conflicting DDL in progress
ORA-29982 Table type not supported for query registration in guaranteed mode
ORA-29983 Unsupported query for Continuous Query Notification
ORA-29985 Query Registration is only supported for automatic undo management
ORA-29990 Cannot complete operation because of cross-instance issue
ORA-30000 missing either trim specification or char expression in TRIM
ORA-30001 trim set should have only one character
ORA-30002 SYS_CONNECT_BY_PATH function is not allowed here
ORA-30004 when using SYS_CONNECT_BY_PATH function, cannot have separator as part of column value
ORA-30005 missing or invalid WAIT interval
ORA-30006 resource busy; acquire with WAIT timeout expired
ORA-30007 CONNECT BY ROOT operator is not supported in the START WITH or in the CONNECT BY condition
ORA-30008 CONNECT BY clause must reference a PRIOR
ORA-30009 Not enough memory for string operation
ORA-30010 Not enough I/O buffers for the sort operation
ORA-30011 Error simulated: psite=string, ptype=string
ORA-30012 undo tablespace 'string' does not exist or of wrong type
ORA-30013 undo tablespace 'string' is currently in use
ORA-30014 operation only supported in Automatic Undo Management mode
ORA-30015 previously offlined undo tablespace 'string' is still pending
ORA-30016 undo tablespace 'string' is already in use by this instance
ORA-30017 segment 'string' is not supported in string Undo Management mode
ORA-30018 Create Rollback Segment failed, USN string is out of range
ORA-30019 Illegal rollback Segment operation in Automatic Undo mode
ORA-30021 Operation not allowed on undo tablespace
ORA-30022 Cannot create segments in undo tablespace
ORA-30023 Duplicate undo tablespace specification
ORA-30024 Invalid specification for CREATE UNDO TABLESPACE
ORA-30025 DROP segment 'string' (in undo tablespace) not allowed
ORA-30026 Undo tablespace 'string' has unexpired undo with string(sec) left, Undo_Retention=string(sec)
ORA-30027 Undo quota violation - failed to get string (bytes)
ORA-30029 no active undo tablespace assigned to instance
ORA-30031 the suspended (resumable) statement has been aborted
ORA-30032 the suspended (resumable) statement has timed out
ORA-30033 Undo tablespace cannot be specified as default user tablespace
ORA-30034 Undo tablespace cannot be specified as temporary tablespace
ORA-30035 Undo tablespace cannot be specified as default temporary tablespace
ORA-30036 unable to extend segment by string in undo tablespace 'string'
ORA-30037 Cannot perform parallel DML after a prior DML on the object
ORA-30038 Cannot perform parallel insert on non-partitioned object
ORA-30039 Cannot drop the undo tablespace
ORA-30040 Undo tablespace is offline
ORA-30041 Cannot grant quota on the tablespace
ORA-30042 Cannot offline the undo tablespace
ORA-30043 Invalid value 'string' specified for parameter 'Undo_Management'
ORA-30044 'Retention' can only specified for undo tablespace
ORA-30045 No undo tablespace name specified
ORA-30046 Undo tablespace string not found in control file.
ORA-30051 VERSIONS clause not allowed here
ORA-30052 invalid lower limit snapshot expression
ORA-30053 invalid upper limit snapshot expression
ORA-30054 invalid upper limit snapshot expression
ORA-30055 NULL snapshot expression not allowed here
ORA-30071 conversion between datetime/interval and string fail
ORA-30072 invalid time zone value
ORA-30073 invalid adjustment value
ORA-30074 GLOBAL partitioned index on TIME/TIMESTAMP WITH TIME ZONE not allowed
ORA-30075 TIME/TIMESTAMP WITH TIME ZONE literal must be specified in CHECK constraint
ORA-30076 invalid extract field for extract source
ORA-30077 illegal casting between specified datetime types
ORA-30078 partition bound must be TIME/TIMESTAMP WITH TIME ZONE literals
ORA-30079 cannot alter database timezone when database has TIMESTAMP WITH LOCAL TIME ZONE columns
ORA-30081 invalid data type for datetime/interval arithmetic
ORA-30082 datetime/interval column to be modified must be empty to decrease fractional second or leading field precision
ORA-30083 syntax error was found in interval value expression
ORA-30084 invalid data type for datetime primary with time zone modifier
ORA-30085 syntax error was found in overlaps predicate
ORA-30086 interval year-month result not allowed for datetime subtraction
ORA-30087 Adding two datetime values is not allowed
ORA-30088 datetime/interval precision is out of range
ORA-30089 missing or invalid <datetime field>
ORA-30091 secondary translation table not loaded
ORA-30092 function not allowed at this stage of DST upgrade process
ORA-30093 function not allowed until the database is restarted
ORA-30094 failed to find the time zone data file for version string in $ORACLE_HOME/oracore/zoneinfo
ORA-30100 internal error [number]
ORA-30101 unknown parameter name 'string'
ORA-30102 'string' is not in the legal range for 'string'
ORA-30103 'string' contains an illegal integer radix for 'string'
ORA-30104 'string' is not a legal integer for 'string'
ORA-30105 'string' is not a legal boolean for 'string'
ORA-30107 parameter name abbreviation 'string' is not unique
ORA-30108 invalid positional parameter value 'string'
ORA-30109 could not open parameter file 'string'
ORA-30110 syntax error at 'string'
ORA-30111 no closing quote for value 'string'
ORA-30112 multiple values not allowed for parameter 'string'
ORA-30113 error when processing file 'string'
ORA-30114 error when processing from command line
ORA-30115 error when processing an environment variable
ORA-30116 syntax error at 'string' following 'string'
ORA-30117 syntax error at 'string' at the start of input
ORA-30118 syntax error at 'string' at the end of input
ORA-30119 unable to obtain a valid value for 'string'
ORA-30120 'string' is not a legal oracle number for 'string'
ORA-30121 'string' is not an allowable value for 'string'
ORA-30122 value 'string' for 'string' must be between 'number' and 'number'
ORA-30129 invalid function argument received
ORA-30130 invalid parameter key type received
ORA-30131 number of keys being set exceeds allocation
ORA-30132 invalid key index supplied
ORA-30135 OCI Thread operation fails
ORA-30136 Drop-in compatibility is not supported for this application
ORA-30150 Invalid argument passed to OCIFile function
ORA-30151 File already exists
ORA-30152 File does not exist
ORA-30153 An invalid File Object is passed to the OCIFile function
ORA-30154 The memory address given as buffer for OCIFileRead/Write is invalid
ORA-30155 An I/O Error occured during an OCIFile function call
ORA-30156 Out of disk space
ORA-30157 An invalid argument was given to operating system call
ORA-30158 The OCIFileWrite causes the file to exceed the maximum allowed size
ORA-30159 OCIFileOpen: Cannot create the file or cannot open in the requested mode
ORA-30160 Unable to access the file
ORA-30161 A system error occurred during the OCIFile function call
ORA-30162 The OCIFile context is not initialzed
ORA-30163 The thread safety initialization failed
ORA-30175 invalid type given for an argument
ORA-30176 invalid format code used in the format string
ORA-30177 invalid flag used in a format specification
ORA-30178 duplicate flag used in a format specification
ORA-30179 invalid argument index used in a format code
ORA-30180 argument index is too large
ORA-30181 integer in argument index is not immediately followed by )
ORA-30182 invalid precision specifier
ORA-30183 invalid field width specifier
ORA-30184 argument type not compatible with a format code
ORA-30185 output too large to fit in the buffer
ORA-30186 '\' must be followed by four hexdecimal characters or another '\'
ORA-30191 missing argument list
ORA-30200 Wrong NLS item was passed into OCINlsGetInfo()
ORA-30201 Unable to load NLS data object
ORA-30202 NULL pointer to OCIMsgh was passed to OCIMsg function
ORA-30203 Cannot open mesage file
ORA-30204 buffer is not large enougth
ORA-30205 invalid Character set
ORA-30331 summary does not exist
ORA-30332 container table already in use by other summary
ORA-30333 dimension does not exist
ORA-30334 illegal dimension level name
ORA-30335 JOIN KEY clause references a level not in this hierarchy
ORA-30336 no child for specified JOIN KEY
ORA-30337 multiple JOIN KEY clauses specified for the same parent level
ORA-30338 illegal dimension hierachy name
ORA-30339 illegal dimension attribute name
ORA-30340 illegal dimension name
ORA-30341 dropped level has references
ORA-30342 referenced level is not defined in this dimension
ORA-30343 level name is not unique within this dimension
ORA-30344 number of child cols different from number of parent level cols
ORA-30345 circular dimension hierarchy
ORA-30346 hierarchy name must be unique within a dimension
ORA-30347 a table name is required to qualify the column specification
ORA-30348 ADD and DROP cannot both be specified
ORA-30349 specified dimension hierarchy does not exist
ORA-30350 specified dimension attribute does not exist
ORA-30351 query rewrite does not currently support this expression
ORA-30352 inconsistent numeric precision or string length
ORA-30353 expression not supported for query rewrite
ORA-30354 Query rewrite not allowed on SYS relations
ORA-30355 materialized view container does not exist
ORA-30356 the specified refresh method is not supported in this context
ORA-30357 this PL/SQL function cannot be supported for query rewrite
ORA-30358 summary and materialized view are not in same schema
ORA-30359 Query rewrite is not supported on SYS materialized views
ORA-30360 REF not supported with query rewrite
ORA-30361 unrecognized string type
ORA-30362 dimension column cannot be a sequence
ORA-30363 columns in a dimension column list must be in the same relation
ORA-30364 this level has the same set of columns as another
ORA-30365 left relation in the JOIN KEY clause cannot be same as right
ORA-30366 child JOIN KEY columns not in same relation as child level
ORA-30367 a JOIN KEY clause is required
ORA-30368 ATTRIBUTE cannot determine column in a different relation
ORA-30369 maximum number of columns is 32
ORA-30370 set operators are not supported in this context
ORA-30371 column cannot define a level in more than one dimension
ORA-30372 fine grain access policy conflicts with materialized view
ORA-30373 object data types are not supported in this context
ORA-30374 materialized view is already fresh
ORA-30375 materialized view cannot be considered fresh
ORA-30376 prevent sharing of a parsed query of an explain rewrite session
ORA-30377 table string.MV_CAPABILITIES_TABLE not found
ORA-30378 MV_CAPABILITIES_TABLE is not compatible with Oracle version
ORA-30379 query txt not specified
ORA-30380 REWRITE_TABLE does not exist
ORA-30381 REWRITE_TABLE is not compatible with Oracle version
ORA-30382 DROP MATERIALIZED VIEW string.string operation is not complete
ORA-30383 specified dimension level does not exist in the attribute
ORA-30384 specified column name does not exist in the attribute
ORA-30385 specified attribute relationship ('string' determines 'string') exists
ORA-30386 invalid SQL statement for DECLARE_REWRITE_EQUIVALENCE
ORA-30387 invalid rewrite mode for REWRITE_EQUIVALENCE API
ORA-30388 name of the rewrite equivalence is not specified
ORA-30389 the source statement is not compatible with the destination statement
ORA-30390 the source statement is not equivalent to the destination statement
ORA-30391 the specified rewrite equivalence does not exist
ORA-30392 the checksum analysis for the rewrite equivalence failed
ORA-30393 a query block in the statement did not rewrite
ORA-30394 source statement identical to the destination statement
ORA-30397 multiple JOIN KEY clauses specified for the same child level
ORA-30398 illegal JOIN KEY clause
ORA-30399 a skip level must have at least one column that allows NULL values
ORA-30400 identical JOIN KEY clauses
ORA-30401 JOIN KEY columns must be non-null
ORA-30403 Daylight Saving Time (DST) upgrade in progress
ORA-30420 string is not a valid identifier
ORA-30430 list does not contain any valid summaries
ORA-30431 refresh method must be ANY or INCREMENTAL or FORCE_FULL, not string
ORA-30432 summary 'string.string' is in INVALID state
ORA-30433 'string.string' is not a summary
ORA-30434 refresh method must be one of FC?AN, not 'string'
ORA-30435 job_queue_processes must be non-zero in order to refresh summaries
ORA-30436 unable to open named pipe 'string'
ORA-30437 all job queue processes have stopped running
ORA-30438 unable to access named pipe 'string'
ORA-30439 refresh of 'string.string' failed because of string
ORA-30440 can't fast refresh;refresh complete or set event 30441 for partial refresh
ORA-30442 can not find the definition for filter string
ORA-30443 definition for filter string's item string is invalid
ORA-30444 rewrite terminated by the sql analyzer
ORA-30445 workload queries not found
ORA-30446 valid workload queries not found
ORA-30447 internal data for run number string is inconsistent
ORA-30448 internal data of the advisor repository is inconsistent
ORA-30449 syntax error in parameter string
ORA-30450 refresh_after_errors was TRUE; The following MVs could not be refreshed: string
ORA-30451 internal error
ORA-30452 cannot compute AVG(X), VARIANCE(X) or STDDEV(X), without COUNT(X) or SUM(X)
ORA-30453 summary contains AVG without corresponding COUNT
ORA-30454 summary contains STDDEV without corresponding SUM & COUNT
ORA-30455 summary contains VARIANCE without corresponding SUM & COUNT
ORA-30456 'string.string' cannot be refreshed because of insufficient privilege
ORA-30457 'string.string' cannot be refreshed because of unmnanaged NOT NULL columns in container
ORA-30458 'string.string' cannot be refreshed because the refresh mask is string
ORA-30459 'string.string' cannot be refreshed because the refresh method is NONE
ORA-30460 'string.string' cannot be refreshed because it is marked UNUSABLE
ORA-30461 'string.string' cannot be refreshed because it is marked DISABLED
ORA-30462 unsupported operator: string
ORA-30463 'string' is not a detail table of any summary
ORA-30464 no summaries exist
ORA-30465 supplied run_id is not valid: string
ORA-30466 can not find the specified workload string
ORA-30467 internal data for filter number string is inconsistent
ORA-30475 feature not enabled: string
ORA-30476 PLAN_TABLE does not exist in the user's schema
ORA-30477 The input select_clause is incorrectly specified
ORA-30478 Specified dimension does not exist
ORA-30479 Summary Advisor error string
ORA-30483 window functions are not allowed here
ORA-30484 missing window specification for this function
ORA-30485 missing ORDER BY expression in the window specification
ORA-30486 invalid window aggregation group in the window specification
ORA-30487 ORDER BY not allowed here
ORA-30488 argument should be a function of expressions in PARTITION BY
ORA-30489 Cannot have more than one rollup/cube expression list
ORA-30490 Ambiguous expression in GROUP BY ROLLUP or CUBE list
ORA-30493 The percentile value should be a number between 0 and 1.
ORA-30500 database open triggers and server error triggers cannot have BEFORE type
ORA-30501 instance shutdown triggers cannot have AFTER type
ORA-30502 system triggers cannot have INSERT, UPDATE, or DELETE as triggering events
ORA-30503 system triggers cannot have a REFERENCING clause
ORA-30504 system triggers cannot have a FOR EACH ROW clause
ORA-30505 system triggers should not reference a column in a WHEN clause
ORA-30506 system triggers cannot be based on tables or views
ORA-30507 normal triggers cannot be based on a schema or a database
ORA-30508 client logon triggers cannot have BEFORE type
ORA-30509 client logoff triggers cannot have AFTER type
ORA-30510 system triggers cannot be defined on the schema of SYS user
ORA-30511 invalid DDL operation in system triggers
ORA-30512 cannot modify string.string more than once in a transaction
ORA-30513 cannot create system triggers of INSTEAD OF type
ORA-30514 system trigger cannot modify tablespace being made read only
ORA-30515 suspend triggers cannot have BEFORE type
ORA-30516 database role change triggers cannot have BEFORE type
ORA-30550 index depends on a package/function spec/body which is not valid
ORA-30551 The index depends on a package/type body which does not exist
ORA-30552 The package/procedure/function cannot be changed
ORA-30553 The function is not deterministic
ORA-30554 function-based index string.string is disabled
ORA-30555 global index partitioning key is an expression
ORA-30556 either functional or bitmap join index is defined on the column to be modified
ORA-30557 function based index could not be properly maintained
ORA-30558 internal error [string] in function based index
ORA-30563 outer join operator (+) not allowed in select-list, CONNECT BY, or START WITH
ORA-30564 Index maintainence clause not allowed for ADD partition to RANGE partitioned tables
ORA-30565 Only one INVALIDATE or UPDATE GLOBAL INDEXES clause may be specified
ORA-30566 Index maintainence clause not allowed for this command
ORA-30567 name already used by an existing log group
ORA-30568 cannot drop log group - nonexistent log group
Personal tools